[Top][All Lists]

[Date Prev][Date Next][Thread Prev][Thread Next][Date Index][Thread Index]

Re: [GNU Autoconf 2.69.35-c8d2] testsuite: 299 300 302 failed

From: Adrian Bunk
Subject: Re: [GNU Autoconf 2.69.35-c8d2] testsuite: 299 300 302 failed
Date: Sat, 13 Oct 2012 02:05:50 +0300
User-agent: Mutt/1.5.21 (2010-09-15)

On Sat, Oct 13, 2012 at 12:15:41AM +0200, Alexander Mansurov wrote:
> Hi,
> I experienced some errors during autoconf compilation from git - 7
> tests failed [4 expected failures]:
> 299: AC_PROG_CC_C89                                  FAILED (acc.at:24)
> 300: AC_PROG_CC_C99                                  FAILED (acc.at:25)
> 302: AC_PROG_CC_STDC                                 FAILED (acc.at:27)
> I was advised to report to you so see attached testsuite.log

Thanks for your report.

This is a known problem, and can be fixed with the following patches:

> Alexander Mansurov



       "Is there not promise of rain?" Ling Tan asked suddenly out
        of the darkness. There had been need of rain for many days.
       "Only a promise," Lao Er said.
                                       Pearl S. Buck - Dragon Seed

reply via email to

[Prev in Thread] Current Thread [Next in Thread]