[Top][All Lists]

[Date Prev][Date Next][Thread Prev][Thread Next][Date Index][Thread Index]

test suite failure: test-dirent-c++

From: Ian Beckwith
Subject: test suite failure: test-dirent-c++
Date: Mon, 20 Jan 2014 00:00:35 +0000
User-agent: Mutt/1.5.21 (2010-09-15)


gnulib-tool --with-c++-tests --test dirent fails (on debian stable amd64) with:

g++ -DHAVE_CONFIG_H -I. -I../../gltests  -DGNULIB_STRICT_CHECKING=1 -I. 
-I../../gltests -I.. -I../../gltests/.. -I../gllib -I../../gltests/../gllib    
-MT test-dirent-c++.o -MD -MP -MF .deps/test-dirent-c++.Tpo -c -o 
test-dirent-c++.o ../../gltests/test-dirent-c++.cc
../../gltests/test-dirent-c++.cc:27:1: error: ‘gnulib’ has not been declared
../../gltests/test-dirent-c++.cc:33:1: error: ‘gnulib’ has not been declared
make[4]: *** [test-dirent-c++.o] Error 1



Ian Beckwith - address@hidden - http://erislabs.net/ianb/
GPG fingerprint: AF6C C0F1 1E74 424B BCD5  4814 40EC C154 A8BA C1EA
Listening to: 65 Days of Static - The Fall of Math - This Cat is A Landmine

Attachment: signature.asc
Description: Digital signature

reply via email to

[Prev in Thread] Current Thread [Next in Thread]