[Top][All Lists]

[Date Prev][Date Next][Thread Prev][Thread Next][Date Index][Thread Index]

[ERROR]execute `make check' to run any self-tests that come with the pac

From: Chance.Yeh
Subject: [ERROR]execute `make check' to run any self-tests that come with the package grub-0.97
Date: Fri, 20 Jul 2012 12:21:12 +0800

Dear Mr./Ms.,

this is my first time to configure GRUB and install it accordingly, however I experience that condition, any ideas??   Hope to hear from you ASAP
(OS: Linux chance-laptop 2.6.32-38-generic #83-Ubuntu SMP Wed Jan 4 11:13:04 UTC 2012 i686 GNU/Linux)

Cheers & BEST

Chance Yeh

address@hidden:~/Workspace/grub-0.97$ make check
Making check in netboot
make[1]: Entering directory `/home/chance/Workspace/grub-0.97/netboot'
make[1]: Nothing to be done for `check'.
make[1]: Leaving directory `/home/chance/Workspace/grub-0.97/netboot'
Making check in stage2
make[1]: Entering directory `/home/chance/Workspace/grub-0.97/stage2'
make  check-am
make[2]: Entering directory `/home/chance/Workspace/grub-0.97/stage2'
make  check-TESTS
make[3]: Entering directory `/home/chance/Workspace/grub-0.97/stage2'
ffs_stage1_5 is too big (134504664 > 7168).
FAIL: size_test
1 of 1 tests failed
Please report to address@hidden
make[3]: *** [check-TESTS] Error 1
make[3]: Leaving directory `/home/chance/Workspace/grub-0.97/stage2'
make[2]: *** [check-am] Error 2
make[2]: Leaving directory `/home/chance/Workspace/grub-0.97/stage2'
make[1]: *** [check] Error 2
make[1]: Leaving directory `/home/chance/Workspace/grub-0.97/stage2'
make: *** [check-recursive] Error 1

reply via email to

[Prev in Thread] Current Thread [Next in Thread]