[Top][All Lists]

[Date Prev][Date Next][Thread Prev][Thread Next][Date Index][Thread Index]

[no subject]

From: Arnold K.
Date: Mon, 16 Jun 2003 16:21:39 -0400

Solaris 9 Mu3
Ultra II dual 300mhz
Memory 256 MB.
gcc 2.95.3 SFW

3 of 102 tests failed
(3 tests were not run)
Please report to address@hidden
make[2]: *** [check-TESTS] Error 1
make[2]: Leaving directory `/var/src/libtool-1.5/tests'
make[1]: *** [check-am] Error 2
make[1]: Leaving directory `/var/src/libtool-1.5/tests'
make: *** [check-recursive] Error 1

Arnold K.

reply via email to

[Prev in Thread] Current Thread [Next in Thread]