[Top][All Lists]

[Date Prev][Date Next][Thread Prev][Thread Next][Date Index][Thread Index]

3 failed tests?

From: Jon Handler
Subject: 3 failed tests?
Date: Thu, 27 Jul 2006 11:49:55 -0400


     I ended up getting 3 failed tests, all being the same test,
depdemo-inst.test. Im running off of Mac OS X 10.4.7, using the bash
shell. Also it gave me this right under your email.

make[2]: *** [check-TESTS] Error 1
make[1]: *** [check-am] Error 2
make: *** [check-recursive] Error 1

I hope this helps.

-Jonathan Handler

reply via email to

[Prev in Thread] Current Thread [Next in Thread]