[Top][All Lists]

[Date Prev][Date Next][Thread Prev][Thread Next][Date Index][Thread Index]

Problem running libtool 1.5 tests

From: William Aiken
Subject: Problem running libtool 1.5 tests
Date: Wed, 29 Aug 2007 14:34:43 -0400
User-agent: Mozilla/5.0 (X11; U; SunOS sun4u; en-US; rv:1.7) Gecko/20060727


 I am trying to build libtool-1.5 on a Solaris 10 x64 (AMD) system
using gmake and Sun Studio 12. I downloaded, built and installed m4
(m4-1.4.4) and autoconf (2.60) before building libtool.

make runs without error messages.
make check fails demo-make.test and quote.test and outputs this at the end:
2 of 104 tests failed
(1 tests were not run)
Please report to address@hidden
make[2]: *** [check-TESTS] Error 1
make[2]: Leaving directory
make[1]: *** [check-am] Error 2
make[1]: Leaving directory
make: *** [check-recursive] Error 1


Bill Aiken

William Aiken          Sun Microsystems, Inc.
Phone: 781.442.3312    ISV Engineering
FAX: 781.442.1520      One Network Drive UBUR01-204
                       Burlington, Massachusetts 01803

reply via email to

[Prev in Thread] Current Thread [Next in Thread]