[Top][All Lists]

[Date Prev][Date Next][Thread Prev][Thread Next][Date Index][Thread Index]

Re: LilyPond 1.5.34

From: Rune Zedeler
Subject: Re: LilyPond 1.5.34
Date: Thu, 28 Feb 2002 15:49:02 +0100 (MET)
User-agent: IMP/PHP IMAP webmail program 2.2.6

make[1]: Entering directory `/users/rz/lilypond/lilypond-1.5.34/Documentation'
make PACKAGE=LILYPOND package=lilypond -C user all &&  make PACKAGE=LILYPOND pac
kage=lilypond -C bibliography all &&  make PACKAGE=LILYPOND package=lilypond -C 
pictures all &&  make PACKAGE=LILYPOND package=lilypond -C topdocs all &&  make 
PACKAGE=LILYPOND package=lilypond -C misc all &&  make PACKAGE=LILYPOND package=
lilypond -C windows all && true
make[2]: Entering directory `/users/rz/lilypond/lilypond-1.5.34/Documentation/us
rm -f out-i686/lilypond.nexi
/usr/local/bin/python ../.././scripts/lilypond-book.py -I /users/rz/lilypond/lil
ypond-1.5.34/Documentation/user -I ./out-i686 -I../.././input -I ../.././input/t
ricks/ -I ../.././input/regression/ -I ../.././input/test/ -I ../.././input/tuto
rial/ --dependencies --outdir=./out-i686 --format=texi --no-lily  lilypond.tely
Traceback (most recent call last):
  File "../.././scripts/lilypond-book.py", line 509, in ?
    newdict[k] = re.compile (olddict[k])
  File "/usr/local/lib/python2.2/sre.py", line 178, in compile
    return _compile(pattern, flags)
  File "/usr/local/lib/python2.2/sre.py", line 228, in _compile
    raise error, v # invalid expression
sre_constants.error: redefinition of group name 'match' as group 2; was group 1
make[2]: *** [out-i686/lilypond.nexi] Error 1
make[2]: Leaving directory `/users/rz/lilypond/lilypond-1.5.34/Documentation/use
make[1]: *** [all] Error 2
make[1]: Leaving directory `/users/rz/lilypond/lilypond-1.5.34/Documentation'
make: *** [all] Error 2

reply via email to

[Prev in Thread] Current Thread [Next in Thread]