[Top][All Lists]

[Date Prev][Date Next][Thread Prev][Thread Next][Date Index][Thread Index]

GPG Errors, all good except gpg 2.2.9

From: Sandro Di Domenico
Subject: GPG Errors, all good except gpg 2.2.9
Date: Sat, 4 Aug 2018 12:50:45 +0200



I try to build gpg, the newest version. I use ‚make‘ all the time before I came up to this error with the make of gpg-build 2.2.9:


60 tests run, 46 succeeded, 11 failed, 0 failed expectedly, 0 succeeded unexpectedly, 3 skipped.

Failed tests: tests/openpgp/ecc.scm tests/openpgp/armor.scm tests/openpgp/gpgv.scm tests/openpgp/verify-multifile.scm tests/openpgp/verify.scm tests/openpgp/signencrypt.scm tests/openpgp/decrypt-unwrap-verify.scm tests/openpgp/decrypt-session-key.scm tests/openpgp/decrypt-dsa.scm tests/openpgp/decrypt-multifile.scm tests/openpgp/decrypt.scm

Skipped tests: tests/openpgp/issue2929.scm tests/openpgp/tofu.scm tests/openpgp/4gb-packet.scm


Makefile:947: recipe for target 'xcheck' failed

make[2]: *** [xcheck] Error 11

make[2]: Leaving directory '/home/git-repos/gnupg-2.2.9/tests/openpgp'

Makefile:534: recipe for target 'check-recursive' failed

make[1]: *** [check-recursive] Error 1

make[1]: Leaving directory '/home/git-repos/gnupg-2.2.9/tests'

Makefile:605: recipe for target 'check-recursive' failed

make: *** [check-recursive] Error 1



Perhaps someone can help me to resolve this problem.



Thank you indeed




reply via email to

[Prev in Thread] Current Thread [Next in Thread]