[Top][All Lists]

[Date Prev][Date Next][Thread Prev][Thread Next][Date Index][Thread Index]

texinfo 4.0c doesn't build with GCC 3.0

From: Frédéric L . W . Meunier
Subject: texinfo 4.0c doesn't build with GCC 3.0
Date: Fri, 29 Jun 2001 08:38:44 -0300
User-agent: Mutt/1.3.19i

gcc -DINFODIR=\"/usr/info\" -DLOCALEDIR=\"/usr/share/locale\"
-DHAVE_CONFIG_H -I.-I/usr/local/src/alpha-beta/GNU/texinfo-4.0c/lib -I../intl
-I.. -I/usr/local/src/alpha-beta/GNU/texinfo-4.0c/info    -O2 -c 
/usr/local/src/alpha-beta/GNU/texinfo-4.0c/info/info.c:567:1: directives may 
not be used inside a macro argument
/usr/local/src/alpha-beta/GNU/texinfo-4.0c/info/info.c:567:1: unterminated 
argument list invoking macro "printf"
/usr/local/src/alpha-beta/GNU/texinfo-4.0c/info/info.c: In function 
/usr/local/src/alpha-beta/GNU/texinfo-4.0c/info/info.c:571: parse error before 
string constant
make[2]: *** [info.o] Error 1
make[2]: Leaving directory /home/pervalidus/objdir/info'
make[1]: *** [all-recursive] Error 1
make[1]: Leaving directory /home/pervalidus/objdir'
make: *** [all-recursive-am] Error 2

address@hidden, {dyndns.}org} Tel: 55-21-2717-2399 (Niterói-RJ BR)

reply via email to

[Prev in Thread] Current Thread [Next in Thread]