[Top][All Lists]

[Date Prev][Date Next][Thread Prev][Thread Next][Date Index][Thread Index]

install texinfo

From: J.W.J. Geenen
Subject: install texinfo
Date: Wed, 21 Nov 2007 10:02:09 +0100


I trie to install texinfo on my iMac PPC OS 10.4.11and follow the instructions in the Install file.
The first two commands came to their end without any error or remark.
The third command make check ended with this remark:
All 23 tests passed
make[2]: Nothing to be done for `check-am'.
Making check in po
make[1]: Nothing to be done for `check'.
Making check in util
makeĀ  defs
make[2]: `defs' is up to date.
makeĀ  check-TESTS
SKIP: bibtex.test
FAIL: dvipdf.test
SKIP: latex2html.test
FAIL: texi2dvi.test
2 of 2 tests failed
(2 tests were not run)
Please report to address@hidden
make[2]: *** [check-TESTS] Error 1
make[1]: *** [check-am] Error 2
make: *** [check-recursive] Error 1

Is here a solution available?


Jan Geenen

reply via email to

[Prev in Thread] Current Thread [Next in Thread]