[Top][All Lists]

[Date Prev][Date Next][Thread Prev][Thread Next][Date Index][Thread Index]

texi2html 5.0 fails base_tests

From: Ryan Kavanagh
Subject: texi2html 5.0 fails base_tests
Date: Mon, 27 May 2013 13:34:11 -0400
User-agent: Mutt/1.5.21 (2010-09-15)


I'm in the process of adopting the texi2html package in Debian. I've
updated it to version 5.0 but it unfortunately fails the base_tests:

    D: diffs/verb_and_char_end_of_line_info.diff
    D: diffs/verb_and_char_end_of_line_all.diff
    D: diffs/empty_ifclear.diff
    D: diffs/empty_ifclear_info.diff
    D: diffs/empty_ifclear_all.diff
    D: diffs/def_braces_and_empty.diff
    D: diffs/def_braces_and_empty_info.diff
    D: diffs/def_braces_and_empty_all.diff
    invalid: 1
    FAIL: base_tests
    1 of 1 test failed
    Please report to address@hidden
    make[4]: *** [check-TESTS] Error 1
    make[4]: Leaving directory `/home/ryan/work/packaging/texi2html/test'
    make[3]: *** [check-am] Error 2
    make[3]: Leaving directory `/home/ryan/work/packaging/texi2html/test'
    make[2]: *** [check-recursive] Error 1
    make[2]: Leaving directory `/home/ryan/work/packaging/texi2html/test'
    make[1]: *** [check-recursive] Error 1
    make[1]: Leaving directory `/home/ryan/work/packaging/texi2html'
    dh_auto_test: make -j1 check returned exit code 2
    make: *** [build] Error 29

I've tried manually running the 'invalid' test via "./tests.sh all
invalid", but didn't get any test failed message. If someone could help
me in debugging this issue (i.e., what causes the test to fail?), I'd be
very grateful.

You'll find attached a full log of
    ./configure && make && make -j1 check
run in a clean/pristine extraction of the 5.0 tarball.

Best wishes,

|_)|_/  Ryan Kavanagh           | Debian Developer
| \| \  http://ryanak.ca/       | GPG Key 4A11C97A

Attachment: checklog
Description: Text document

Attachment: signature.asc
Description: Digital signature

reply via email to

[Prev in Thread] Current Thread [Next in Thread]