[Top][All Lists]

[Date Prev][Date Next][Thread Prev][Thread Next][Date Index][Thread Index]

Build error (no nls)

From: shoober420
Subject: Build error (no nls)
Date: Fri, 20 Aug 2021 13:51:37 -0400

I'm getting a build error when compiling from latest git master as of this email (https://git.savannah.gnu.org/cgit/texinfo.git/commit/?id=05261ac09977c25e22a1c58955e11c0041cb3e4d). Im using Gentoo Linux and GCC 11.2 version. full log attached.

make[4]: Leaving directory '/var/tmp/portage/sys-apps/texinfo-9999/work/texinfo-9999/po_document'
...................... done.
rm -f ca.us-ascii.gmo && /usr/bin/msgmerge --for-msgfmt -o ca.us-ascii.1po ca.us-ascii.po texinfo_document.pot && /usr/bin/gmsgfmt -c --statistics --verbose -o ca.us-ascii.gmo ca.us-ascii.1po && rm -f ca.us-ascii.1po
ca.us-ascii.1po: 183 translated messages.
make[4]: Leaving directory '/var/tmp/portage/sys-apps/texinfo-9999/work/texinfo-9999/po_document'
make[3]: Leaving directory '/var/tmp/portage/sys-apps/texinfo-9999/work/texinfo-9999/tp'
make[2]: *** [Makefile:3577: all-recursive] Error 1
make[2]: Leaving directory '/var/tmp/portage/sys-apps/texinfo-9999/work/texinfo-9999/tp'
make[1]: *** [Makefile:1473: all-recursive] Error 1
make[1]: Leaving directory '/var/tmp/portage/sys-apps/texinfo-9999/work/texinfo-9999'
make: *** [Makefile:1412: all] Error 2

Attachment: buildtexinfo-no-nls.log
Description: Text Data

reply via email to

[Prev in Thread] Current Thread [Next in Thread]