[Top][All Lists]

[Date Prev][Date Next][Thread Prev][Thread Next][Date Index][Thread Index]

Problems to install guile 2.0.1

From: Germán Arias
Subject: Problems to install guile 2.0.1
Date: Thu, 28 Apr 2011 17:22:52 -0600

Hi, I'm facing problems to install Guile 2.0.1. Similar problems that I
had with Guile 2.0.0. If you remember:

I will try to solve this later, as I did before (removing some
characters). But now the compiler show some info, so I send you these:  

  CC     libguile_2.0_la-variable.lo
  CC     libguile_2.0_la-vectors.lo
  CC     libguile_2.0_la-version.lo
  CC     libguile_2.0_la-vm.lo
vm-engine.c: In function 'vm_debug_engine':
vm-engine.c:38: internal compiler error: in unify_nodes, at
Please submit a full bug report,
with preprocessed source if appropriate.
See <URL:> for instructions.
For Debian GNU/Linux specific bug reporting instructions,
see <URL:file:///usr/share/doc/gcc-4.2/README.Bugs>.
make[3]: *** [libguile_2.0_la-vm.lo] Error 1
make[3]: Leaving directory
make[2]: *** [all] Error 2
make[2]: Leaving directory
make[1]: *** [all-recursive] Error 1
make[1]: Leaving directory `/home/german/Instalados/guile-2.0.1'
make: *** [all] Error 2

This is a problem in the compiler. But this is the compiler that comes
with gNewSense (from Ubuntu). Also I will notify this to gNewSense team.

reply via email to

[Prev in Thread] Current Thread [Next in Thread]