[Top][All Lists]

[Date Prev][Date Next][Thread Prev][Thread Next][Date Index][Thread Index]

Re: GNU Guile 2.9.7 Released [beta]

From: tomas
Subject: Re: GNU Guile 2.9.7 Released [beta]
Date: Sat, 14 Dec 2019 08:40:35 +0100
User-agent: Mutt/1.5.21 (2010-09-15)

(Sorry for the cross-post, see below)

On Fri, Dec 13, 2019 at 09:23:46PM -0500, John Cowan wrote:
> I am getting the following build error on both Cygwin and Ubuntu Xenial.
> All is well until:
>   BOOTSTRAP GUILEC system/vm/linker.go
> /bin/bash: line 6: 16683 Segmentation fault      (core dumped)
> GUILE_AUTO_COMPILE=0 ../meta/build-env guild compile
> --target="x86_64-pc-linux-gnu" -O1 -Oresolve-primitives -L
> "/home/rr828893/guile-2.9.7/module" -L
> "/home/rr828893/guile-2.9.7/guile-readline" -o "system/vm/linker.go"
> "../module/system/vm/linker.scm"
> Makefile:1930: recipe for target 'system/vm/linker.go' failed
> make[2]: *** [system/vm/linker.go] Error 139
> make[2]: Leaving directory '/home/rr828893/guile-2.9.7/bootstrap'
> Makefile:1849: recipe for target 'all-recursive' failed
> make[1]: *** [all-recursive] Error 1
> make[1]: Leaving directory '/home/rr828893/guile-2.9.7'
> Makefile:1735: recipe for target 'all' failed
> make: *** [all] Error 2

This sounds exactly like the bug Matt Wette is stumbling upon.
He posted to guile-devel@, so I don't know whether you missed
it, in any case it's here in the archive [1].

FWIW, Matt worked around it by removing "-Oresolve-primitives"
from the compile options.

I don't know whether there's a bug report on it already.



-- tomás

Attachment: signature.asc
Description: Digital signature

reply via email to

[Prev in Thread] Current Thread [Next in Thread]