[Top][All Lists]

[Date Prev][Date Next][Thread Prev][Thread Next][Date Index][Thread Index]

only tagdemo-make.test fails (two times)

From: Robert Boehne
Subject: only tagdemo-make.test fails (two times)
Date: Tue, 26 Sep 2000 17:03:35 -0500

I am testing some changes to the multi-language-branch of libtool.
It appears to work, but "tagdemo-make.test" fails both times it is
run in the 'check' target.  It appears that there should be a
library installed into $(builddir)/_inst/lib but none of the
other tests (that presumably do the installation) fail.

When is this directory supposed to be made?

Here's the output:
=== Running tagdemo-make.test
Making in ../tagdemo
make[3]: Entering directory `/tmp_mnt/boreas/libtool/tagdemo'
/bin/sh ./libtool --mode=compile cxx -DHAVE_MATH_H=1  -I.
-I/tmp_mnt/boreas/libtool/tests/../tagdemo     -g -c -o baz.lo baz.cpp
mkdir .libs
cxx -DHAVE_MATH_H=1 -I. -I/tmp_mnt/boreas/libtool/tests/../tagdemo -g -c
baz.cpp   -DPIC -o .libs/baz.o
/bin/sh ./libtool --mode=compile cxx -DHAVE_MATH_H=1  -I.
-I/tmp_mnt/boreas/libtool/tests/../tagdemo     -g -c -o foo.lo foo.cpp
cxx -DHAVE_MATH_H=1 -I. -I/tmp_mnt/boreas/libtool/tests/../tagdemo -g -c
foo.cpp   -DPIC -o .libs/foo.o
/bin/sh ./libtool --mode=link cxx  -g   -o   foo.lo -lm 
ar cru .libs/libfoo.a .libs/foo.o
ranlib .libs/libfoo.a
(cd .libs && rm -f && ln -s ../
/bin/sh ./libtool --mode=link cxx  -g   -o -rpath
/tmp_mnt/boreas/libtool/tests/_inst/lib  baz.lo 
rm -fr .libs/libbaz.lax
mkdir .libs/libbaz.lax
rm -fr .libs/libbaz.lax/libfoo.a
mkdir .libs/libbaz.lax/libfoo.a
(cd .libs/libbaz.lax/libfoo.a && ar x
cxx -hidden /usr/lib/cmplrs/cxx/libcxxstd.a -non_hidden -shared
${wl}-expect_unresolved ${wl}\*   .libs/baz.o
.libs/libbaz.lax/libfoo.a/foo.o   ./.libs/libfoo.a -lm  -lc   -Wl,-msym
-soname `test -n "0.0.0:0.0" && echo -Wl,-set_version
-Wl,"0.0.0:0.0"` -update_registry .libs/so_locations -o
(cd .libs && rm -f && ln -s
(cd .libs && rm -f && ln -s
rm -fr .libs/libbaz.lax
(cd .libs && rm -f && ln -s ../
cxx -DHAVE_MATH_H=1  -I. -I/tmp_mnt/boreas/libtool/tests/../tagdemo    
-g -c -o main.o main.cpp
/bin/sh ./libtool --mode=link cxx  -g   -o tagdemo  main.o 
cxx -g -o .libs/tagdemo main.o  ./.libs/ -lm -Wl,-rpath
ld (prelink):
Can't open: /tmp_mnt/boreas/libtool/tests/_inst/lib (No such file or
Can't open: /tmp_mnt/boreas/libtool/tests/_inst/lib (No such file or
make[3]: *** [tagdemo] Error 1
make[3]: Leaving directory `/tmp_mnt/boreas/libtool/tagdemo'
FAIL: tagdemo-make.test
=== Running tagdemo-exec.test
You must run tagdemo-make.test before running ./tagdemo-exec.test
2 of 90 tests failed
make[2]: *** [check-TESTS] Error 1
make[2]: Leaving directory `/tmp_mnt/boreas/libtool/tests'
make[1]: *** [check-am] Error 2
make[1]: Leaving directory `/tmp_mnt/boreas/libtool/tests'
make: *** [check-recursive] Error 1

Robert Boehne             Software Engineer
Ricardo Software   Chicago Technical Center
TEL: (630)789-0003 x. 238
FAX: (630)789-0127
email:  address@hidden

reply via email to

[Prev in Thread] Current Thread [Next in Thread]