[Top][All Lists]

[Date Prev][Date Next][Thread Prev][Thread Next][Date Index][Thread Index]

libtool installation failure

From: WST
Subject: libtool installation failure
Date: Sun, 23 Dec 2001 21:14:32 -0600

Hello, I have Redhat 6.2 and have been upgrading it and now am getting several errors.  They all seem to be related to perl in one way or another.  I upgraded to perl 5.6.1 via source.  I get an error about no dumb defintion when I try to pico a file.  I also got test failures when installing
Any help will be greatly appreciated.  I am a newbie at this and its getting frustrating.
FAIL: demo-inst.test
PASS: hardcode.test
FAIL: build-relink.test
PASS: noinst-link.test
PASS: demo-unst.test
PASS: depdemo-shared.test
PASS: depdemo-make.test
FAIL: depdemo-exec.test
FAIL: depdemo-inst.test
FAIL: build-relink2.test
PASS: depdemo-unst.test
PASS: mdemo-shared.test
PASS: mdemo-make.test
FAIL: mdemo-exec.test
FAIL: mdemo-inst.test
PASS: mdemo-unst.test
PASS: assign.test
PASS: link.test
PASS: link-2.test
PASS: nomode.test
PASS: quote.test
PASS: sh.test
PASS: suffix.test
19 of 83 tests failed
make[2]: *** [check-TESTS] Error 1
make[2]: Leaving directory `/usr/local/downloads/libtool-1.4.2/tests'
make[1]: *** [check-am] Error 2
make[1]: Leaving directory `/usr/local/downloads/libtool-1.4.2/tests'
make: *** [check-recursive] Error 1

reply via email to

[Prev in Thread] Current Thread [Next in Thread]