[Top][All Lists]

[Date Prev][Date Next][Thread Prev][Thread Next][Date Index][Thread Index]

[Paparazzi-devel] NPS Simulation Problem in Ubuntu 13.04

From: Fauzi
Subject: [Paparazzi-devel] NPS Simulation Problem in Ubuntu 13.04
Date: Wed, 19 Jun 2013 04:32:40 +0200
User-agent: Mozilla/5.0 (X11; Linux x86_64; rv:17.0) Gecko/20130510 Thunderbird/17.0.6

Hi everyone,

I have a problem during "build" operation for generating NPS simulation of Quad_LisaM_2. The error message as below:

CC /home/mfauzi/phdWorks/paparazzi/var/Quad_LisaM_2/nps/subsystems/ins/vf_float.o
LD /home/mfauzi/phdWorks/paparazzi/var/Quad_LisaM_2/nps/simsitl
/usr/bin/ld: /usr/lib/x86_64-linux-gnu/ undefined reference to symbol 'pcre_study'
/usr/bin/ld: note: 'pcre_study' is defined in DSO /lib/x86_64-linux-gnu/ so try adding it to the linker command line
/lib/x86_64-linux-gnu/ could not read symbols: Invalid operation
collect2: error: ld returned 1 exit status
make[1]: *** [/home/mfauzi/phdWorks/paparazzi/var/Quad_LisaM_2/nps/simsitl] Error 1
make[1]: Leaving directory `/home/mfauzi/phdWorks/paparazzi/sw/airborne'
make: *** [nps.compile] Error 2

I am using paparazzi v5.0 stable and Ubuntu 13.04
Could anyone help me to solve it?


reply via email to

[Prev in Thread] Current Thread [Next in Thread]