[Top][All Lists]

[Date Prev][Date Next][Thread Prev][Thread Next][Date Index][Thread Index]

[Protux-support] compiler exits at curve.o

From: Olaf Meltzer
Subject: [Protux-support] compiler exits at curve.o
Date: Thu, 6 Feb 2003 14:27:42 +0100

Hello experts,

I try to install protux on my linux-system (SuSE 8.0). First 
I compiled and installed libmustux-0.17.0. No problems so 

 After untaring protux-0.16.0.tar.gz in
/install I cd protux-0.16.0 and asked my system, please do
'make -f admin/Makefile.common'

Seems, he was so kind, since I got no errors.

No problem, as far as I could recognize, when i asked for


When I call 


there is heavy action going on inside my machine, but 
unfortunatly not without claiming. I cite the last lines 
here, hopefully, somebody is kind enough to help me.

The machine ends:

Making all in filters
make[3]: Wechsel in das Verzeichnis Verzeichnis 
source='' object='Curve.o' libtool=no \
depfile='.deps/Curve.Po' tmpdepfile='.deps/Curve.TPo' \
depmode=gcc /bin/sh ../../admin/depcomp \
g++ -DHAVE_CONFIG_H -I. -I. -I../.. -I/usr/lib/qt3/include 
-O2 -fno-exceptions -fno-check-new  -c -o Curve.o `test -f || echo './'`
In file included from ../Slice.hh:50,
                 from ../Track.hh:113,
                 from ../Song.hh:269,
                 from Curve.hh:63,
../Mixer.hh:88: `MAX_BUSES' undeclared in namespace 
../Mixer.hh:89: `MAX_BUSES' undeclared in namespace 
make[3]: *** [Curve.o] Fehler 1
make[3]: Verlassen des Verzeichnisses Verzeichnis 
make[2]: *** [all-recursive] Fehler 1
make[2]: Verlassen des Verzeichnisses Verzeichnis 
make[1]: *** [all-recursive] Fehler 1
make[1]: Verlassen des Verzeichnisses Verzeichnis 
make: *** [all] Fehler 2
linux:/install/protux-0.16.0 #

Is there anything, I should install first? I read the docs 
and AFAICS everything mentioned there is on the systems 
harddisc. But - who knows ...

Sincerely, Olaf Meltzer

reply via email to

[Prev in Thread] Current Thread [Next in Thread]